Reaction Details
TargetSerine-protein kinase ATM
LigandBDBM50571461
Substrate/Competitorn/a
Meas. Tech.Biological Assay
IC50 5.50±n/a nM
Citation Toledo-Sherman, LMDominguez, CBreccia, PVan De Poël, AJWishart, GVater, HDEsmieu, WRClissold, CBlackaby, WP ATM kinase inhibitors and compositions and methods of use thereof US Patent US11685734 Publication Date 6/27/2023
 
Serine-protein kinase ATM
Name:Serine-protein kinase ATM
Type:Protein
Mol. Mass.:350696.72
Organism:Homo sapiens (Human)
Description:Q13315
Residue:3056
BDBM50571461
NameBDBM50571461
Synonyms:CHEMBL4866506 | US11685734, Example 96
TypeSmall organic molecule
Emp. Form.C20H24FN3O2
Mol. Mass.357.4219
SMILESF[C@@H]1CCN([C@H]1Cc1ccccc1)c1cc(cc(=O)[nH]1)N1CCOCC1