Reaction Details
TargetSerine-protein kinase ATM
LigandBDBM606890
Substrate/Competitorn/a
Meas. Tech.Biological Assay
IC50 3.30±n/a nM
Citation Toledo-Sherman, LMDominguez, CBreccia, PVan De Poël, AJWishart, GVater, HDEsmieu, WRClissold, CBlackaby, WP ATM kinase inhibitors and compositions and methods of use thereof US Patent US11685734 Publication Date 6/27/2023
 
Serine-protein kinase ATM
Name:Serine-protein kinase ATM
Type:Protein
Mol. Mass.:350696.72
Organism:Homo sapiens (Human)
Description:Q13315
Residue:3056
BDBM606890
NameBDBM606890
Synonyms:US11685734, Example 124
TypeSmall organic molecule
Emp. Form.C23H29N3O2
Mol. Mass.379.4953
SMILESO=c1cc(cc([nH]1)N1C[C@@H]2CCC[C@@H]2[C@@H]1Cc1ccccc1)N1CCOCC1