Reaction Details
TargetSerine-protein kinase ATM
LigandBDBM606901
Substrate/Competitorn/a
Meas. Tech.Biological Assay
IC50 5.10±n/a nM
Citation Toledo-Sherman, LMDominguez, CBreccia, PVan De Poël, AJWishart, GVater, HDEsmieu, WRClissold, CBlackaby, WP ATM kinase inhibitors and compositions and methods of use thereof US Patent US11685734 Publication Date 6/27/2023
 
Serine-protein kinase ATM
Name:Serine-protein kinase ATM
Type:Protein
Mol. Mass.:350696.72
Organism:Homo sapiens (Human)
Description:Q13315
Residue:3056
BDBM606901
NameBDBM606901
Synonyms:US11685734, Example 176
TypeSmall organic molecule
Emp. Form.C20H26N4O2
Mol. Mass.354.446
SMILESCn1c(nc(cc1=O)N1CCOCC1)N1CCC[C@@H]1Cc1ccccc1