Reaction Details
TargetSerine-protein kinase ATM
LigandBDBM606903
Substrate/Competitorn/a
Meas. Tech.Biological Assay
IC50 1.20±n/a nM
Citation Toledo-Sherman, LMDominguez, CBreccia, PVan De Poël, AJWishart, GVater, HDEsmieu, WRClissold, CBlackaby, WP ATM kinase inhibitors and compositions and methods of use thereof US Patent US11685734 Publication Date 6/27/2023
 
Serine-protein kinase ATM
Name:Serine-protein kinase ATM
Type:Protein
Mol. Mass.:350696.72
Organism:Homo sapiens (Human)
Description:Q13315
Residue:3056
BDBM606903
NameBDBM606903
Synonyms:US11685734, Example 181
TypeSmall organic molecule
Emp. Form.C22H30N4O2
Mol. Mass.382.4992
SMILESCc1ccccc1C[C@H]1CCCCCN1c1nc(cc(=O)[nH]1)N1CCOCC1