Reaction Details
TargetSerine-protein kinase ATM
LigandBDBM606906
Substrate/Competitorn/a
Meas. Tech.Biological Assay
IC50 4.20±n/a nM
Citation Toledo-Sherman, LMDominguez, CBreccia, PVan De Poël, AJWishart, GVater, HDEsmieu, WRClissold, CBlackaby, WP ATM kinase inhibitors and compositions and methods of use thereof US Patent US11685734 Publication Date 6/27/2023
 
Serine-protein kinase ATM
Name:Serine-protein kinase ATM
Type:Protein
Mol. Mass.:350696.72
Organism:Homo sapiens (Human)
Description:Q13315
Residue:3056
BDBM606906
NameBDBM606906
Synonyms:US11685734, Example 190
TypeSmall organic molecule
Emp. Form.C19H22Cl2N4O2
Mol. Mass.409.31
SMILESClc1ccc(C[C@H]2CCCN2c2nc(cc(=O)[nH]2)N2CCOCC2)cc1Cl