Reaction Details
TargetSerine-protein kinase ATM
LigandBDBM606913
Substrate/Competitorn/a
Meas. Tech.Biological Assay
IC50 1.90±n/a nM
Citation Toledo-Sherman, LMDominguez, CBreccia, PVan De Poël, AJWishart, GVater, HDEsmieu, WRClissold, CBlackaby, WP ATM kinase inhibitors and compositions and methods of use thereof US Patent US11685734 Publication Date 6/27/2023
 
Serine-protein kinase ATM
Name:Serine-protein kinase ATM
Type:Protein
Mol. Mass.:350696.72
Organism:Homo sapiens (Human)
Description:Q13315
Residue:3056
BDBM606913
NameBDBM606913
Synonyms:US11685734, Example 203
TypeSmall organic molecule
Emp. Form.C22H30N4O3
Mol. Mass.398.4986
SMILESCOc1cccc(C[C@H]2CCCCCN2c2nc(cc(=O)[nH]2)N2CCOCC2)c1