Reaction Details
TargetSerine-protein kinase ATM
LigandBDBM606923
Substrate/Competitorn/a
Meas. Tech.Biological Assay
IC50 3.90±n/a nM
Citation Toledo-Sherman, LMDominguez, CBreccia, PVan De Poël, AJWishart, GVater, HDEsmieu, WRClissold, CBlackaby, WP ATM kinase inhibitors and compositions and methods of use thereof US Patent US11685734 Publication Date 6/27/2023
 
Serine-protein kinase ATM
Name:Serine-protein kinase ATM
Type:Protein
Mol. Mass.:350696.72
Organism:Homo sapiens (Human)
Description:Q13315
Residue:3056
BDBM606923
NameBDBM606923
Synonyms:US11685734, Example 225
TypeSmall organic molecule
Emp. Form.C23H30N4O3
Mol. Mass.410.5093
SMILESO=c1cc(nc([nH]1)N1CCCCC[C@@H]1Cc1cccc2CCOc12)N1CCOCC1