Reaction Details
TargetSerine-protein kinase ATM
LigandBDBM606928
Substrate/Competitorn/a
Meas. Tech.Biological Assay
IC50 5.30±n/a nM
Citation Toledo-Sherman, LMDominguez, CBreccia, PVan De Poël, AJWishart, GVater, HDEsmieu, WRClissold, CBlackaby, WP ATM kinase inhibitors and compositions and methods of use thereof US Patent US11685734 Publication Date 6/27/2023
 
Serine-protein kinase ATM
Name:Serine-protein kinase ATM
Type:Protein
Mol. Mass.:350696.72
Organism:Homo sapiens (Human)
Description:Q13315
Residue:3056
BDBM606928
NameBDBM606928
Synonyms:US11685734, Example 235
TypeSmall organic molecule
Emp. Form.C22H29FN4O2
Mol. Mass.400.4897
SMILESC[C@H]1CCCN([C@@H](Cc2ccc(F)cc2)C1)c1nc(cc(=O)[nH]1)N1CCOCC1