Reaction Details
TargetSerine-protein kinase ATM
LigandBDBM606943
Substrate/Competitorn/a
Meas. Tech.Biological Assay
IC50 1.70±n/a nM
Citation Toledo-Sherman, LMDominguez, CBreccia, PVan De Poël, AJWishart, GVater, HDEsmieu, WRClissold, CBlackaby, WP ATM kinase inhibitors and compositions and methods of use thereof US Patent US11685734 Publication Date 6/27/2023
 
Serine-protein kinase ATM
Name:Serine-protein kinase ATM
Type:Protein
Mol. Mass.:350696.72
Organism:Homo sapiens (Human)
Description:Q13315
Residue:3056
BDBM606943
NameBDBM606943
Synonyms:US11685734, Example 259
TypeSmall organic molecule
Emp. Form.C19H23FN4O2
Mol. Mass.358.4099
SMILESF[C@@H]1CCN([C@H]1Cc1ccccc1)c1nc(cc(=O)[nH]1)N1CCOCC1