Reaction Details
TargetSerine-protein kinase ATM
LigandBDBM50571475
Substrate/Competitorn/a
Meas. Tech.Biological Assay
IC50 5.50±n/a nM
Citation Toledo-Sherman, LMDominguez, CBreccia, PVan De Poël, AJWishart, GVater, HDEsmieu, WRClissold, CBlackaby, WP ATM kinase inhibitors and compositions and methods of use thereof US Patent US11685734 Publication Date 6/27/2023
 
Serine-protein kinase ATM
Name:Serine-protein kinase ATM
Type:Protein
Mol. Mass.:350696.72
Organism:Homo sapiens (Human)
Description:Q13315
Residue:3056
BDBM50571475
NameBDBM50571475
Synonyms:CHEMBL4853948 | US11685734, Example 292
TypeSmall organic molecule
Emp. Form.C21H26N4O2
Mol. Mass.366.4567
SMILES[H][C@@]12C[C@]1([H])[C@H](Cc1ccccc1)N(C2)c1nc(cc(=O)[nH]1)N1CCO[C@H](C)C1