Reaction Details
TargetSerine-protein kinase ATM
LigandBDBM606967
Substrate/Competitorn/a
Meas. Tech.Biological Assay
IC50 5.30±n/a nM
Citation Toledo-Sherman, LMDominguez, CBreccia, PVan De Poël, AJWishart, GVater, HDEsmieu, WRClissold, CBlackaby, WP ATM kinase inhibitors and compositions and methods of use thereof US Patent US11685734 Publication Date 6/27/2023
 
Serine-protein kinase ATM
Name:Serine-protein kinase ATM
Type:Protein
Mol. Mass.:350696.72
Organism:Homo sapiens (Human)
Description:Q13315
Residue:3056
BDBM606967
NameBDBM606967
Synonyms:US11685734, Example 319
TypeSmall organic molecule
Emp. Form.C20H25FN4O2
Mol. Mass.372.4365
SMILESC[C@@H]1CN(CCO1)c1cc(=O)[nH]c(n1)N1CC[C@@H](F)[C@@H]1Cc1ccccc1