Reaction Details
TargetSerine-protein kinase ATM
LigandBDBM606970
Substrate/Competitorn/a
Meas. Tech.Biological Assay
IC50 5.40±n/a nM
Citation Toledo-Sherman, LMDominguez, CBreccia, PVan De Poël, AJWishart, GVater, HDEsmieu, WRClissold, CBlackaby, WP ATM kinase inhibitors and compositions and methods of use thereof US Patent US11685734 Publication Date 6/27/2023
 
Serine-protein kinase ATM
Name:Serine-protein kinase ATM
Type:Protein
Mol. Mass.:350696.72
Organism:Homo sapiens (Human)
Description:Q13315
Residue:3056
BDBM606970
NameBDBM606970
Synonyms:US11685734, Example 324
TypeSmall organic molecule
Emp. Form.C21H27FN4O3
Mol. Mass.402.4625
SMILESCOc1ccccc1C[C@H]1[C@@H](F)CCN1c1nc(cc(=O)[nH]1)N1CCO[C@H](C)C1