Reaction Details
TargetcAMP-specific 3',5'-cyclic phosphodiesterase 7B
LigandBDBM607116
Substrate/Competitorn/a
Meas. Tech.Enzymatic Assay
IC50<10.00±n/a nM
Citation Santora, VJChen, MChung, D Substituted benzoxazole and benzofuran compounds as PDE7 inhibitors US Patent US11685745 Publication Date 6/27/2023
 
cAMP-specific 3',5'-cyclic phosphodiesterase 7B
Name:cAMP-specific 3',5'-cyclic phosphodiesterase 7B
Type:Enzyme
Mol. Mass.:51842.76
Organism:Homo sapiens (Human)
Description:Q9NP56
Residue:450
BDBM607116
NameBDBM607116
Synonyms:US11685745, Example 336
TypeSmall organic molecule
Emp. Form.C22H22ClF2N3O3
Mol. Mass.449.878
SMILESFC1(F)[C@H]2CC(C[C@@H]12)NC(=O)c1cc2cc(Cl)c3NC(=O)NC4(CCCCC4)c3c2o1