Reaction Details
TargetcAMP-specific 3',5'-cyclic phosphodiesterase 7B
LigandBDBM607124
Substrate/Competitorn/a
Meas. Tech.Enzymatic Assay
IC50<10.00±n/a nM
Citation Santora, VJChen, MChung, D Substituted benzoxazole and benzofuran compounds as PDE7 inhibitors US Patent US11685745 Publication Date 6/27/2023
 
cAMP-specific 3',5'-cyclic phosphodiesterase 7B
Name:cAMP-specific 3',5'-cyclic phosphodiesterase 7B
Type:Enzyme
Mol. Mass.:51842.76
Organism:Homo sapiens (Human)
Description:Q9NP56
Residue:450
BDBM607124
NameBDBM607124
Synonyms:US11685745, Example 576 | US11685745, Example 581
TypeSmall organic molecule
Emp. Form.C22H28ClN3O4
Mol. Mass.433.928
SMILESCO[C@@H]1COCC[C@H]1NCc1cc2cc(Cl)c3NC(=O)NC4(CCCCC4)c3c2o1