Reaction Details
TargetcAMP-specific 3',5'-cyclic phosphodiesterase 7B
LigandBDBM607202
Substrate/Competitorn/a
Meas. Tech.Enzymatic Assay
IC50 55.0±n/a nM
Citation Santora, VJChen, MChung, D Substituted benzoxazole and benzofuran compounds as PDE7 inhibitors US Patent US11685745 Publication Date 6/27/2023
 
cAMP-specific 3',5'-cyclic phosphodiesterase 7B
Name:cAMP-specific 3',5'-cyclic phosphodiesterase 7B
Type:Enzyme
Mol. Mass.:51842.76
Organism:Homo sapiens (Human)
Description:Q9NP56
Residue:450
BDBM607202
NameBDBM607202
Synonyms:US11685745, Example 125
TypeSmall organic molecule
Emp. Form.C20H25ClN4O3
Mol. Mass.404.891
SMILESCOC1CCN(Cc2nc3cc(Cl)c4NC(=O)NC5(CCCCC5)c4c3o2)C1