Reaction Details
TargetcAMP-specific 3',5'-cyclic phosphodiesterase 7B
LigandBDBM607214
Substrate/Competitorn/a
Meas. Tech.Enzymatic Assay
IC50 55.0±n/a nM
Citation Santora, VJChen, MChung, D Substituted benzoxazole and benzofuran compounds as PDE7 inhibitors US Patent US11685745 Publication Date 6/27/2023
 
cAMP-specific 3',5'-cyclic phosphodiesterase 7B
Name:cAMP-specific 3',5'-cyclic phosphodiesterase 7B
Type:Enzyme
Mol. Mass.:51842.76
Organism:Homo sapiens (Human)
Description:Q9NP56
Residue:450
BDBM607214
NameBDBM607214
Synonyms:US11685745, Example 138
TypeSmall organic molecule
Emp. Form.C18H20ClF3N4O3
Mol. Mass.432.825
SMILESFC(F)(F)OCCNCc1nc2cc(Cl)c3NC(=O)NC4(CCCCC4)c3c2o1