Reaction Details
TargetTransient receptor potential cation channel subfamily A member 1
LigandBDBM611236
Substrate/Competitorn/a
Meas. Tech.Measurement of TRPA1 Antagonist Activity
IC50 0.610±n/a nM
Citation Kobayashi, KSuzuki, TFujii, TOkuzumi, T Heterocyclic sulfonamide derivative and medicine comprising same US Patent US10626112 Publication Date 4/21/2020
 
Transient receptor potential cation channel subfamily A member 1
Name:Transient receptor potential cation channel subfamily A member 1
Type:Protein
Mol. Mass.:127514.20
Organism:Homo sapiens (Human)
Description:O75762
Residue:1119
BDBM611236
NameBDBM611236
Synonyms:(2S)-1-(5-fluorobenzofuran-2- yl)sulfonyl-N-[[2-[4- (trifluoromethoxy)phenyl]-4- pyridyl]methyl]pyrrolidine-2- carboxamide | US10626112, Example 129
TypeSmall organic molecule
Emp. Form.C26H21F4N3O5S
Mol. Mass.563.521
SMILESFc1ccc2oc(cc2c1)S(=O)(=O)N1CCCC1C(=O)NCc1ccnc(c1)-c1ccc(OC(F)(F)F)cc1