Reaction Details
TargetTyrosine-protein kinase JAK1
LigandBDBM292110
Substrate/Competitorn/a
Meas. Tech.Biochemical Assay
Ki<0.1±n/a nM
Citation Fatheree, PRJacobsen, JRBeausoleil, ABrandt, GEFleury, MJiang, LSmith, CSullivan, SDVan Orden, LJColson, PFass, GTRapta, MBenjamin, NDabros, MThalladi, VR JAK kinase inhibitor compounds for treatment of respiratory disease US Patent US11718616 Publication Date 8/8/2023
 
Tyrosine-protein kinase JAK1
Name:Tyrosine-protein kinase JAK1
Type:Protein
Mol. Mass.:133293.73
Organism:Homo sapiens (Human)
Description:P23458
Residue:1154
BDBM292110
NameBDBM292110
Synonyms:US10100049, Example 7 US10526330, Example 7 US11299492, Example 7 | US11718616, Example 7
TypeSmall organic molecule
Emp. Form.C25H29FN6O
Mol. Mass.448.5358
SMILESCCc1cc(O)c(F)cc1-c1ccc2c(n[nH]c2c1)-c1nc2CN(CCN(C)C)CCc2[nH]1