Reaction Details
TargetTyrosine-protein kinase JAK2
LigandBDBM292114
Substrate/Competitorn/a
Meas. Tech.Biochemical Assay
Ki<0.1±n/a nM
Citation Fatheree, PRJacobsen, JRBeausoleil, ABrandt, GEFleury, MJiang, LSmith, CSullivan, SDVan Orden, LJColson, PFass, GTRapta, MBenjamin, NDabros, MThalladi, VR JAK kinase inhibitor compounds for treatment of respiratory disease US Patent US11718616 Publication Date 8/8/2023
 
Tyrosine-protein kinase JAK2
Name:Tyrosine-protein kinase JAK2
Type:Protein
Mol. Mass.:130684.68
Organism:Homo sapiens (Human)
Description:O60674
Residue:1132
BDBM292114
NameBDBM292114
Synonyms:US10100049, Example 11 US10526330, Example 11 US11299492, Example 11 | US11718616, Example 11
TypeSmall organic molecule
Emp. Form.C27H31FN6O
Mol. Mass.474.573
SMILESCCc1cc(O)c(F)cc1-c1ccc2c(n[nH]c2c1)-c1nc2CN(C[C@@H]3CCCN3C)CCc2[nH]1