Reaction Details
TargetTyrosine-protein kinase JAK3
LigandBDBM292127
Substrate/Competitorn/a
Meas. Tech.Biochemical Assay
Ki<0.1±n/a nM
Citation Fatheree, PRJacobsen, JRBeausoleil, ABrandt, GEFleury, MJiang, LSmith, CSullivan, SDVan Orden, LJColson, PFass, GTRapta, MBenjamin, NDabros, MThalladi, VR JAK kinase inhibitor compounds for treatment of respiratory disease US Patent US11718616 Publication Date 8/8/2023
 
Tyrosine-protein kinase JAK3
Name:Tyrosine-protein kinase JAK3
Type:Protein
Mol. Mass.:125111.08
Organism:Homo sapiens (Human)
Description:P52333
Residue:1124
BDBM292127
NameBDBM292127
Synonyms:US10100049, Example 4-2 US11718616, Example 4-2
TypeSmall organic molecule
Emp. Form.C26H29FN6O
Mol. Mass.460.5465
SMILESCCc1cc(O)c(F)cc1-c1ccc2c(n[nH]c2c1)-c1nc2CN(C[C@H]3CCCN3)CCc2[nH]1