Reaction Details
TargetEstrogen receptor beta
LigandBDBM26189
Substrate/Competitorn/a
Meas. Tech.Competitive Binding Assay
IC50>250000±n/a nM
Citation Gallucci, RRMahood, JAOdle, RRDimond, S Polyetherimide compositions and methods for the manufacture and use thereof US Patent US9688816 Publication Date 6/27/2017
 
Estrogen receptor beta
Name:Estrogen receptor beta
Type:Protein
Mol. Mass.:59238.43
Organism:Homo sapiens (Human)
Description:Q92731
Residue:530
BDBM26189
NameBDBM26189
Synonyms:α-CA inhibitor, 13 1,3-dihydroxybenzene US9688816, 4 phenol derivative, 3
TypeSmall organic molecule
Emp. Form.C6H6O2
Mol. Mass.110.1106
SMILESOc1cccc(O)c1