Reaction Details
TargetTyrosine-protein kinase ABL2
LigandBDBM612783
Substrate/Competitorn/a
Meas. Tech.Measurement of c-Abl1, c-Abl2 and c-Kit IC50 Values
IC50 35.0±n/a nM
Citation Werner, MHKelly, TA Compositions and methods for inhibiting kinases US Patent US11725005 Publication Date 8/15/2023
 
Tyrosine-protein kinase ABL2
Name:Tyrosine-protein kinase ABL2
Type:PROTEIN
Mol. Mass.:128360.63
Organism:Homo sapiens (Human)
Description:ChEMBL_325082
Residue:1182
BDBM612783
NameBDBM612783
Synonyms:US11725005, Compound 117
TypeSmall organic molecule
Emp. Form.C35H38N10O2
Mol. Mass.630.742
SMILESCN(C)C(=O)c1cc([nH]n1)-c1cncc(c1)-c1ccnc(Nc2cc(NC(=O)c3ccc(CN4CCN(C)CC4)cc3)ccc2C)n1