Reaction Details
TargetTyrosine-protein kinase ABL2
LigandBDBM612784
Substrate/Competitorn/a
Meas. Tech.Measurement of c-Abl1, c-Abl2 and c-Kit IC50 Values
IC50 51.0±n/a nM
Citation Werner, MHKelly, TA Compositions and methods for inhibiting kinases US Patent US11725005 Publication Date 8/15/2023
 
Tyrosine-protein kinase ABL2
Name:Tyrosine-protein kinase ABL2
Type:PROTEIN
Mol. Mass.:128360.63
Organism:Homo sapiens (Human)
Description:ChEMBL_325082
Residue:1182
BDBM612784
NameBDBM612784
Synonyms:US11725005, Compound 118
TypeSmall organic molecule
Emp. Form.C32H33N9O
Mol. Mass.559.6641
SMILESCN1CCN(Cc2ccc(cc2)C(=O)Nc2ccc(C)c(Nc3nccc(n3)-c3cncc(c3)-c3cn[nH]c3)c2)CC1