Reaction Details
TargetTyrosine-protein kinase ABL2
LigandBDBM481137
Substrate/Competitorn/a
Meas. Tech.Measurement of c-Abl1, c-Abl2 and c-Kit IC50 Values
IC50 91.0±n/a nM
Citation Werner, MHKelly, TA Compositions and methods for inhibiting kinases US Patent US11725005 Publication Date 8/15/2023
 
Tyrosine-protein kinase ABL2
Name:Tyrosine-protein kinase ABL2
Type:PROTEIN
Mol. Mass.:128360.63
Organism:Homo sapiens (Human)
Description:ChEMBL_325082
Residue:1182
BDBM481137
NameBDBM481137
Synonyms:US10906896, Cpd 8190 | US11725005, Compound 8190
TypeSmall organic molecule
Emp. Form.C33H34N8OS
Mol. Mass.590.741
SMILESCN1CCN(Cc2ccc(cc2)C(=O)Nc2ccc(C)c(Nc3nccc(n3)-c3cncc(c3)-c3cc(C)ns3)c2)CC1