Reaction Details
TargetHistone deacetylase 2
LigandBDBM163628
Substrate/Competitorn/a
IC50 3880±n/a nM
Citation Liao, DRoush, WRStowe, RL HDAC inhibitor compounds and methods of treatment US Patent US11731934 Publication Date 8/22/2023
 
Histone deacetylase 2
Name:Histone deacetylase 2
Type:Chromatin regulator; hydrolase; repressor
Mol. Mass.:55356.54
Organism:Homo sapiens (Human)
Description:Q92769
Residue:488
BDBM163628
NameBDBM163628
Synonyms:SR-3212 US11731934, Compound RLS2-137
TypeSmall organic molecule
Emp. Form.C10H13BrN2O
Mol. Mass.257.127
SMILESCCCNNC(=O)c1ccc(Br)cc1