Reaction Details
TargetHistone deacetylase 2
LigandBDBM163633
Substrate/Competitorn/a
IC50 28450±n/a nM
Citation Liao, DRoush, WRStowe, RL HDAC inhibitor compounds and methods of treatment US Patent US11731934 Publication Date 8/22/2023
 
Histone deacetylase 2
Name:Histone deacetylase 2
Type:Chromatin regulator; hydrolase; repressor
Mol. Mass.:55356.54
Organism:Homo sapiens (Human)
Description:Q92769
Residue:488
BDBM163633
NameBDBM163633
Synonyms:SR-3364 US11731934, Compound RLS2-256
TypeSmall organic molecule
Emp. Form.C13H17BrN2O
Mol. Mass.297.191
SMILESBrc1ccc(cc1)C(=O)NNCC1CCCC1