Reaction Details
TargetLysine-specific demethylase 6B
LigandBDBM270494
Substrate/Competitorn/a
Meas. Tech.In Vitro Enzyme Inhibition Assay for JMJD3 Activity
IC50 550±n/a nM
Citation Chen, YKWallace, MB Histone demethylase inhibitors US Patent US11731954 Publication Date 8/22/2023
 
Lysine-specific demethylase 6B
Name:Lysine-specific demethylase 6B
Type:Protein
Mol. Mass.:176672.55
Organism:Homo sapiens (Human)
Description:O15054
Residue:1643
BDBM270494
NameBDBM270494
Synonyms:3-[({(1S)-6-[methyl(4-methylphenyl)amino]-1,2,3,4-tetra-hydroisoquinolyl}methyl)amino]pyridine-4-carboxylic acid US11001568, Example 1A | US11731954, Example 1A
TypeSmall organic molecule
Emp. Form.C24H26N4O2
Mol. Mass.402.4888
SMILESCN(c1ccc(C)cc1)c1ccc2[C@@H](CNc3cnccc3C(O)=O)NCCc2c1