Reaction Details
TargetLysine-specific demethylase 5B
LigandBDBM270532
Substrate/Competitorn/a
Meas. Tech.In Vitro Enzyme Inhibition Assay for Jarid1B Activity
IC50<100±n/a nM
Citation Chen, YKWallace, MB Histone demethylase inhibitors US Patent US11731954 Publication Date 8/22/2023
 
Lysine-specific demethylase 5B
Name:Lysine-specific demethylase 5B
Type:Protein
Mol. Mass.:175659.67
Organism:Homo sapiens (Human)
Description:Q9UGL1
Residue:1544
BDBM270532
NameBDBM270532
Synonyms:(R)-3-(((2-methyl-5-(methyl(4-propylphenyl)amino)iso-indolin-1-yl)methyl)amino)isonicotinic acid US11001568, Example 20A | US11731954, Example 20A and 20B
TypeSmall organic molecule
Emp. Form.C26H30N4O2
Mol. Mass.430.542
SMILESCCCc1ccc(cc1)N(C)c1ccc2[C@H](CNc3cnccc3C(O)=O)N(C)Cc2c1