Reaction Details
TargetSerine/threonine-protein kinase mTOR
LigandBDBM50606737
Substrate/Competitorn/a
Meas. Tech.Inhibitory Activity on mTOR Kinase
Ki 0.400±n/a nM
Citation Clary, LFournier, JOuvry, GBhurruth-Alcor, YThoreau, ETomas, L Substituted pyrazolo[3,4-d]pyrimidines as mTOR inhibitors US Patent US11731973 Publication Date 8/22/2023
 
Serine/threonine-protein kinase mTOR
Name:Serine/threonine-protein kinase mTOR
Type:Rapamycin target protein
Mol. Mass.:288917.12
Organism:Homo sapiens (Human)
Description:P42345
Residue:2549
BDBM50606737
NameBDBM50606737
Synonyms:CHEMBL5218727 | US11731973, Example 5
TypeSmall organic molecule
Emp. Form.C18H21FN8O
Mol. Mass.384.4107
SMILESCC(C)C[C@H](C)n1nc(-c2ccc3oc(N)nc3c2F)c2c(N)nc(N)nc12