Reaction Details
TargetGlycogen synthase kinase-3 beta
LigandBDBM293492
Substrate/Competitorn/a
Meas. Tech.GSK3β Kinase Assay
EC50 1.000±n/a nM
Citation KC, SKMak, CCEastman, BWCao, JBollu, VMittapalli, GKChiruta, C ISOQUINOLIN-3-YL CARBOXAMIDES AND PREPARATION AND USE THEREOF US Patent US20230286945 Publication Date 9/14/2023
 
Glycogen synthase kinase-3 beta
Name:Glycogen synthase kinase-3 beta
Type:Enzyme
Mol. Mass.:46756.38
Organism:Homo sapiens (Human)
Description:P49841
Residue:420
BDBM293492
NameBDBM293492
Synonyms:US10106527, Compound 108 US11548872, Compound 108 US9951048, Compound 108
TypeSmall organic molecule
Emp. Form.C21H19N5O
Mol. Mass.357.4085
SMILESCn1cc(cn1)-c1ccc2cnc(NC(=O)CCc3ccncc3)cc2c1