Reaction Details
TargetN-formyl peptide receptor 2
LigandBDBM620556
Substrate/Competitorn/a
Meas. Tech.cAMP Assay
EC50 0.100±n/a nM
Citation Shirude, PSRachamreddy, CRBaligar, VSeshadri, BMadduri, SRKick, EKWurtz, NR OXOPYRROLIDINE UREA FPR2 AGONISTS US Patent US20230303513 Publication Date 9/28/2023
 
N-formyl peptide receptor 2
Name:N-formyl peptide receptor 2
Type:G Protein-Coupled Receptor (GPCR)
Mol. Mass.:38968.35
Organism:Homo sapiens (Human)
Description:P25090
Residue:351
BDBM620556
NameBDBM620556
Synonyms:US20230303513, Example 4
TypeSmall organic molecule
Emp. Form.C25H24F2N4O5
Mol. Mass.498.4787
SMILESCOc1cc(F)c([C@@H]2CN(C(=O)[C@H]2NC(=O)Nc2ccccc2)c2c(OC)ccn(C)c2=O)c(F)c1