Reaction Details
TargetN-formyl peptide receptor 2
LigandBDBM620557
Substrate/Competitorn/a
Meas. Tech.cAMP Assay
EC50 0.200±n/a nM
Citation Shirude, PSRachamreddy, CRBaligar, VSeshadri, BMadduri, SRKick, EKWurtz, NR OXOPYRROLIDINE UREA FPR2 AGONISTS US Patent US20230303513 Publication Date 9/28/2023
 
N-formyl peptide receptor 2
Name:N-formyl peptide receptor 2
Type:G Protein-Coupled Receptor (GPCR)
Mol. Mass.:38968.35
Organism:Homo sapiens (Human)
Description:P25090
Residue:351
BDBM620557
NameBDBM620557
Synonyms:US20230303513, Example 16 | US20230303513, Example 5
TypeSmall organic molecule
Emp. Form.C30H33ClN4O5
Mol. Mass.565.06
SMILESCOCCn1cccc(N2C[C@H]([C@H](NC(=O)NC3CCc4cc(Cl)ccc4C3)C2=O)c2ccc(OC)cc2)c1=O