Reaction Details
TargetIsoform 2 of MAP kinase-interacting serine/threonine-protein kinase 1 (MNK1a) 344D]
LigandBDBM176763
Substrate/Competitorn/a
Meas. Tech.MKNK1 Kinase High ATP Assay
pH7.5±n/a
IC50 36±n/a nM
Commentsextracted
Citation Klar, UWortmann, LGraham, KPuehler, FSülzle, DKettschau, GLienau, P Substituted thiazolopyrimidines US Patent US9675612 Publication Date 6/13/2017
 
Isoform 2 of MAP kinase-interacting serine/threonine-protein kinase 1 (MNK1a) 344D]
Name:Isoform 2 of MAP kinase-interacting serine/threonine-protein kinase 1 (MNK1a) 344D]
Type:Protein
Mol. Mass.:47416.00
Organism:Homo sapiens (Human)
Description:Q9BUB5-2 with T344D
Residue:424
BDBM176763
NameBDBM176763
Synonyms:US9675612, 9 2-(Cyclopropylmethyl)-N-(1H-indazol-5-yl)[1,3]thiazolo[5,4-d]pyrimidin-7-amine
TypeSmall organic molecule
Emp. Form.C16H14N6S
Mol. Mass.322.388
SMILESC(C1CC1)c1nc2c(Nc3ccc4[nH]ncc4c3)ncnc2s1