Reaction Details
TargetIsoform 2 of MAP kinase-interacting serine/threonine-protein kinase 1 (MNK1a) 344D]
LigandBDBM176791
Substrate/Competitorn/a
Meas. Tech.MKNK1 Kinase High ATP Assay
pH7.5±n/a
IC50 42±n/a nM
Commentsextracted
Citation Klar, UWortmann, LGraham, KPuehler, FSülzle, DKettschau, GLienau, P Substituted thiazolopyrimidines US Patent US9675612 Publication Date 6/13/2017
 
Isoform 2 of MAP kinase-interacting serine/threonine-protein kinase 1 (MNK1a) 344D]
Name:Isoform 2 of MAP kinase-interacting serine/threonine-protein kinase 1 (MNK1a) 344D]
Type:Protein
Mol. Mass.:47416.00
Organism:Homo sapiens (Human)
Description:Q9BUB5-2 with T344D
Residue:424
BDBM176791
NameBDBM176791
Synonyms:US9675612, 30 7-[(6-Ethoxy-1H-indazol-5-yl)amino]-N, N-dimethyl[1,3]thiazolo[5,4-d]pyrimidine-2-carboxamide
TypeSmall organic molecule
Emp. Form.C17H17N7O2S
Mol. Mass.383.428
SMILESCCOc1cc2[nH]ncc2cc1Nc1ncnc2sc(nc12)C(=O)N(C)C