Reaction Details
TargetIsoform 2 of MAP kinase-interacting serine/threonine-protein kinase 1 (MNK1a) 344D]
LigandBDBM176795
Substrate/Competitorn/a
Meas. Tech.MKNK1 Kinase High ATP Assay
pH7.5±n/a
IC50 17±n/a nM
Commentsextracted
Citation Klar, UWortmann, LGraham, KPuehler, FSülzle, DKettschau, GLienau, P Substituted thiazolopyrimidines US Patent US9675612 Publication Date 6/13/2017
 
Isoform 2 of MAP kinase-interacting serine/threonine-protein kinase 1 (MNK1a) 344D]
Name:Isoform 2 of MAP kinase-interacting serine/threonine-protein kinase 1 (MNK1a) 344D]
Type:Protein
Mol. Mass.:47416.00
Organism:Homo sapiens (Human)
Description:Q9BUB5-2 with T344D
Residue:424
BDBM176795
NameBDBM176795
Synonyms:US9675612, 33 {7-[(6-Methoxy-1H-indazol-5-yl)amino][1,3]thiazolo[5,4-d]pyrimidin-2-yl}(piperidin-1-yl)methanone
TypeSmall organic molecule
Emp. Form.C19H19N7O2S
Mol. Mass.409.465
SMILESCOc1cc2[nH]ncc2cc1Nc1ncnc2sc(nc12)C(=O)N1CCCCC1