Reaction Details
TargetInterleukin-1 receptor-associated kinase 4
LigandBDBM621083
Substrate/Competitorn/a
Meas. Tech.Kinase Inhibitory Assay
IC50<0.500±n/a nM
Citation HOYT, SBTHOMAS, CJFINOCCHIO, CJSTARCZYNOWSKI, DTTAWA, GJGRACIA MALDONADO, GROSEBAUM, JS MULTI-CYCLIC IRAK AND FLT3 INHIBITING COMPOUNDS AND USES THEREOF US Patent US20230303563 Publication Date 9/28/2023
 
Interleukin-1 receptor-associated kinase 4
Name:Interleukin-1 receptor-associated kinase 4
Type:Protein
Mol. Mass.:51519.08
Organism:Homo sapiens (Human)
Description:Q9NWZ3
Residue:460
BDBM621083
NameBDBM621083
Synonyms:(R)-N-(6-(6-(1- methylcyclopropyl)- imidazo-[1,2-a]- pyridin-3-yl)-pyridin- 2-yl)-5-azaspiro[2.4]- heptan-7-amine | US20230303563, Compound 17
TypeSmall organic molecule
Emp. Form.C22H25N5
Mol. Mass.359.4674
SMILESCC1(CC1)c1ccc2ncc(-c3cccc(N[C@H]4CNCC44CC4)n3)n2c1