Reaction Details
TargetReceptor-type tyrosine-protein kinase FLT3
LigandBDBM621134
Substrate/Competitorn/a
Meas. Tech.Kinase Inhibitory Assay
IC50<0.500±n/a nM
Citation HOYT, SBTHOMAS, CJFINOCCHIO, CJSTARCZYNOWSKI, DTTAWA, GJGRACIA MALDONADO, GROSEBAUM, JS MULTI-CYCLIC IRAK AND FLT3 INHIBITING COMPOUNDS AND USES THEREOF US Patent US20230303563 Publication Date 9/28/2023
 
Receptor-type tyrosine-protein kinase FLT3
Name:Receptor-type tyrosine-protein kinase FLT3
Type:Enzyme
Mol. Mass.:112888.62
Organism:Homo sapiens (Human)
Description:P36888
Residue:993
BDBM621134
NameBDBM621134
Synonyms:N-((3S,4S)-4- fluoropiperidin-3-yl)-6-(7- isopropoxyimidazo[1,2- a]pyridin-3-yl)pyridin-2- amine | US20230303563, Compound 202
TypeSmall organic molecule
Emp. Form.C20H24FN5O
Mol. Mass.369.4359
SMILESCC(C)Oc1ccn2c(cnc2c1)-c1cccc(N[C@H]2CNCC[C@@H]2F)n1