Reaction Details
TargetPresequence protease, mitochondrial
LigandBDBM622051
Substrate/Competitorn/a
Meas. Tech.hPrep Inhibition Assay
IC50 140±n/a nM
Citation BRÅNALT, JHOLM, BJOHANSSON, MKARLSSON, OKNERR, DLNORDQVIST, ASHEPPARD, RJSWANSON, MTOMBERG, A N-(2-(4-CYANOTHIAZOLIDIN-3-YL)-2-OXOETHYL)-QUINOLINE-4-CARBOXAMIDES US Patent US20230312550 Publication Date 10/5/2023
 
Presequence protease, mitochondrial
Name:Presequence protease, mitochondrial
Type:PROTEIN
Mol. Mass.:117419.85
Organism:Homo sapiens (Human)
Description:ChEMBL_108043
Residue:1037
BDBM622051
NameBDBM622051
Synonyms:US20230312550, Example 11
TypeSmall organic molecule
Emp. Form.C20H19N5O3S
Mol. Mass.409.462
SMILESO=C(CNC(=O)c1ccnc2ccc(cc12)N1CCCC1=O)N1CSC[C@H]1C#N