Reaction Details
TargetPresequence protease, mitochondrial
LigandBDBM622105
Substrate/Competitorn/a
Meas. Tech.hPrep Inhibition Assay
IC50 100.0±n/a nM
Citation BRÅNALT, JHOLM, BJOHANSSON, MKARLSSON, OKNERR, DLNORDQVIST, ASHEPPARD, RJSWANSON, MTOMBERG, A N-(2-(4-CYANOTHIAZOLIDIN-3-YL)-2-OXOETHYL)-QUINOLINE-4-CARBOXAMIDES US Patent US20230312550 Publication Date 10/5/2023
 
Presequence protease, mitochondrial
Name:Presequence protease, mitochondrial
Type:PROTEIN
Mol. Mass.:117419.85
Organism:Homo sapiens (Human)
Description:ChEMBL_108043
Residue:1037
BDBM622105
NameBDBM622105
Synonyms:US20230312550, Example 65
TypeSmall organic molecule
Emp. Form.C21H23N5O2S
Mol. Mass.409.505
SMILESC[C@H]1CCCN1c1ccc2nccc(C(=O)NCC(=O)N3CSC[C@H]3C#N)c2c1