Reaction Details
TargetPresequence protease, mitochondrial
LigandBDBM622155
Substrate/Competitorn/a
Meas. Tech.hPrep Inhibition Assay
IC50 130±n/a nM
Citation BRÅNALT, JHOLM, BJOHANSSON, MKARLSSON, OKNERR, DLNORDQVIST, ASHEPPARD, RJSWANSON, MTOMBERG, A N-(2-(4-CYANOTHIAZOLIDIN-3-YL)-2-OXOETHYL)-QUINOLINE-4-CARBOXAMIDES US Patent US20230312550 Publication Date 10/5/2023
 
Presequence protease, mitochondrial
Name:Presequence protease, mitochondrial
Type:PROTEIN
Mol. Mass.:117419.85
Organism:Homo sapiens (Human)
Description:ChEMBL_108043
Residue:1037
BDBM622155
NameBDBM622155
Synonyms:US20230312550, Example 115
TypeSmall organic molecule
Emp. Form.C23H22N6O2S
Mol. Mass.446.525
SMILESO=C(CNC(=O)c1ccnc2ccc(cc12)-n1cc2CCCCc2n1)N1CSC[C@H]1C#N