Reaction Details
TargetPresequence protease, mitochondrial
LigandBDBM622225
Substrate/Competitorn/a
Meas. Tech.hPrep Inhibition Assay
IC50 130±n/a nM
Citation BRÅNALT, JHOLM, BJOHANSSON, MKARLSSON, OKNERR, DLNORDQVIST, ASHEPPARD, RJSWANSON, MTOMBERG, A N-(2-(4-CYANOTHIAZOLIDIN-3-YL)-2-OXOETHYL)-QUINOLINE-4-CARBOXAMIDES US Patent US20230312550 Publication Date 10/5/2023
 
Presequence protease, mitochondrial
Name:Presequence protease, mitochondrial
Type:PROTEIN
Mol. Mass.:117419.85
Organism:Homo sapiens (Human)
Description:ChEMBL_108043
Residue:1037
BDBM622225
NameBDBM622225
Synonyms:US20230312550, Example 185
TypeSmall organic molecule
Emp. Form.C25H22FN5O2S
Mol. Mass.475.538
SMILESFc1ccc(cc1)C1CN(C1)c1ccc2nccc(C(=O)NCC(=O)N3CSC[C@H]3C#N)c2c1