Reaction Details
TargetPresequence protease, mitochondrial
LigandBDBM622263
Substrate/Competitorn/a
Meas. Tech.hPrep Inhibition Assay
IC50 86.0±n/a nM
Citation BRÅNALT, JHOLM, BJOHANSSON, MKARLSSON, OKNERR, DLNORDQVIST, ASHEPPARD, RJSWANSON, MTOMBERG, A N-(2-(4-CYANOTHIAZOLIDIN-3-YL)-2-OXOETHYL)-QUINOLINE-4-CARBOXAMIDES US Patent US20230312550 Publication Date 10/5/2023
 
Presequence protease, mitochondrial
Name:Presequence protease, mitochondrial
Type:PROTEIN
Mol. Mass.:117419.85
Organism:Homo sapiens (Human)
Description:ChEMBL_108043
Residue:1037
BDBM622263
NameBDBM622263
Synonyms:US20230312550, Example 223
TypeSmall organic molecule
Emp. Form.C27H26FN5O2S
Mol. Mass.503.591
SMILESFC1(CCN(CC1)c1ccc2nccc(C(=O)NCC(=O)N3CSC[C@H]3C#N)c2c1)c1ccccc1