Reaction Details
TargetPresequence protease, mitochondrial
LigandBDBM622272
Substrate/Competitorn/a
Meas. Tech.hPrep Inhibition Assay
IC50 7.10±n/a nM
Citation BRÅNALT, JHOLM, BJOHANSSON, MKARLSSON, OKNERR, DLNORDQVIST, ASHEPPARD, RJSWANSON, MTOMBERG, A N-(2-(4-CYANOTHIAZOLIDIN-3-YL)-2-OXOETHYL)-QUINOLINE-4-CARBOXAMIDES US Patent US20230312550 Publication Date 10/5/2023
 
Presequence protease, mitochondrial
Name:Presequence protease, mitochondrial
Type:PROTEIN
Mol. Mass.:117419.85
Organism:Homo sapiens (Human)
Description:ChEMBL_108043
Residue:1037
BDBM622272
NameBDBM622272
Synonyms:(R)-N-(2-(4-cyanothiazolidin-3-yl)-2-oxoethyl)-quinoline-4-carboxamide US20230406840, Example C
TypeSmall organic molecule
Emp. Form.C16H14N4O2S
Mol. Mass.326.373
SMILESO=C(CNC(=O)c1ccnc2ccccc12)N1CSC[C@H]1C#N