Reaction Details
TargetRibonucleoside-diphosphate reductase large subunit/subunit M2
LigandBDBM50198892
Substrate/Competitorn/a
Meas. Tech.holoenzyme assay
IC50 1200±130 nM
Citation Horne, DLincoln, C Ribonucleotide reductase inhibitors and methods of use US Patent US10155732 Publication Date 12/18/2018
 
Ribonucleoside-diphosphate reductase large subunit/subunit M2
Name:Ribonucleoside-diphosphate reductase large subunit/subunit M2
Type:Enzyme
Mol. Mass.:n/a
Description:n/a
Components:This complex has 2 components.
Component 1
Name:Ribonucleoside-diphosphate reductase large subunit
Synonyms:RIR1_HUMAN RRM1 Ribonucleoside-diphosphate reductase subunit M1 | Ribonucleotide reductase large subunit
Type:PROTEIN
Mol. Mass.:90074.67
Organism:Homo sapiens (Human)
Description:ChEMBL_90946
Residue:792
Component 2
Name:Ribonucleoside-diphosphate reductase subunit M2
Synonyms:RIR2_HUMAN RRM2 Ribonucleotide reductase small chain | Ribonucleotide reductase small subunit
Type:PROTEIN
Mol. Mass.:44868.59
Organism:Homo sapiens (Human)
Description:ChEMBL_195255
Residue:389
BDBM50198892
NameBDBM50198892
Synonyms:3-AP Triapine | US10155732, Compound 3-AP
TypeSmall organic molecule
Emp. Form.C7H9N5S
Mol. Mass.195.245
SMILESNC(=S)N\N=C\c1ncccc1N