Reaction Details
TargetAlpha-2B adrenergic receptor
LigandBDBM626057
Substrate/Competitorn/a
Meas. Tech.SPR Assay
IC50 1450±n/a nM
Citation Bell, ASSchreyer, AMVersluys, S Pyrazolopyrimidine compounds as adenosine receptor antagonists US Patent US11786528 Publication Date 10/17/2023
 
Alpha-2B adrenergic receptor
Name:Alpha-2B adrenergic receptor
Type:Enzyme
Mol. Mass.:49964.20
Organism:Homo sapiens (Human)
Description:P18089
Residue:450
BDBM626057
NameBDBM626057
Synonyms:US11786528, Example 19
TypeSmall organic molecule
Emp. Form.C16H13FN6S
Mol. Mass.340.378
SMILESCc1ccc(Cn2cc3c(N)nc(nc3n2)-c2ccsn2)cc1F