Reaction Details
TargetAlpha-2B adrenergic receptor
LigandBDBM626180
Substrate/Competitorn/a
Meas. Tech.SPR Assay
IC50 1460±n/a nM
Citation Bell, ASSchreyer, AMVersluys, S Pyrazolopyrimidine compounds as adenosine receptor antagonists US Patent US11786528 Publication Date 10/17/2023
 
Alpha-2B adrenergic receptor
Name:Alpha-2B adrenergic receptor
Type:Enzyme
Mol. Mass.:49964.20
Organism:Homo sapiens (Human)
Description:P18089
Residue:450
BDBM626180
NameBDBM626180
Synonyms:US11786528, Example 40
TypeSmall organic molecule
Emp. Form.C16H14N6O2
Mol. Mass.322.3214
SMILESCOc1ccccc1Cn1cc2c(N)nc(nc2n1)-c1cnco1