Reaction Details
TargetTyrosine-protein kinase SYK [342-635]
LigandBDBM311139
Substrate/Competitorn/a
Meas. Tech.SYK Kinase Inhibition Test
IC50 0.800±n/a nM
Citation Hoffmann, MDahmann, GGnamm, CFandrick, DRScott, JMcCarthy, C Pyrazolyl-substituted heteroaryls and their use as medicaments US Patent US10155751 Publication Date 12/18/2018
 
Tyrosine-protein kinase SYK [342-635]
Name:Tyrosine-protein kinase SYK [342-635]
Type:Enzyme Catalytic Domain
Mol. Mass.:34105.36
Organism:Homo sapiens (Human)
Description:P43405[342-635]
Residue:294
BDBM311139
NameBDBM311139
Synonyms:example 3B.22 on page 219 of WO15017610
TypeSmall organic molecule
Emp. Form.C21H27N5O2
Mol. Mass.381.4714
SMILESC[C@@H](Oc1cc(cc2ncn(C)c12)-c1cnn(c1)C(C)(C)C)[C@H]1CNC(=O)C1