Reaction Details
TargetAcetylcholinesterase
LigandBDBM8964
Substrate/CompetitorBDBM8959
Meas. Tech.Enzyme Inhibition Assay
IC50 7.8±n/a nM
Citation Carlier, PRChow, ESHan, YLiu, JEl Yazal, JPang, YP Heterodimeric tacrine-based acetylcholinesterase inhibitors: investigating ligand-peripheral site interactions. J Med Chem42:4225-31 (1999) 
 
Acetylcholinesterase
Name:Acetylcholinesterase
Type:Enzyme
Mol. Mass.:68193.62
Organism:Rattus norvegicus (rat)
Description:P37136
Residue:614
BDBM8964
BDBM8959
NameBDBM8964
Synonyms:CHEMBL75274 N-[8-(1,2,3,4-tetrahydroacridin-9-ylamino)octyl]-1,2,3,4-tetrahydroacridin-9-amine Tacrine-Based Inhibitor 2g
TypeSmall organic molecule
Emp. Form.C34H42N4
Mol. Mass.506.7241
SMILESC(CCCCNc1c2CCCCc2nc2ccccc12)CCCNc1c2CCCCc2nc2ccccc12