Reaction Details
TargetAP2-associated protein kinase 1
LigandBDBM311344
Substrate/Competitorn/a
Meas. Tech.AAK1 Kinase Assay
IC50 0.640±n/a nM
Citation Luo, GDzierba, CDMacor, JE Biaryl kinase inhibitors US Patent US10155760 Publication Date 12/18/2018
 
AP2-associated protein kinase 1
Name:AP2-associated protein kinase 1
Type:PROTEIN
Mol. Mass.:103884.23
Organism:Homo sapiens (Human)
Description:ChEMBL_774569
Residue:961
BDBM311344
NameBDBM311344
Synonyms:(S)-1-((3-(difluoromethyl)-5-(5,7-difluoroquinolin-4-yl)pyridin-2-yl)oxy)-2,4-dimethylpentan-2-amine US10351563, Example 201 US10723734, Example 201 US9902722, Example 201
TypeSmall organic molecule
Emp. Form.C22H23F4N3O
Mol. Mass.421.4311
SMILESCC(C)C[C@](C)(N)COc1ncc(cc1C(F)F)-c1ccnc2cc(F)cc(F)c12