Reaction Details
TargetAP2-associated protein kinase 1
LigandBDBM311363
Substrate/Competitorn/a
Meas. Tech.AAK1 Kinase Assay
IC50 0.380±n/a nM
Citation Luo, GDzierba, CDMacor, JE Biaryl kinase inhibitors US Patent US10155760 Publication Date 12/18/2018
 
AP2-associated protein kinase 1
Name:AP2-associated protein kinase 1
Type:PROTEIN
Mol. Mass.:103884.23
Organism:Homo sapiens (Human)
Description:ChEMBL_774569
Residue:961
BDBM311363
NameBDBM311363
Synonyms:(S)-methyl (6-((2-amino-2,4-dimethylpentyl)oxy)-5-(trifluoromethyl)-[3,4′-bipyridin]-2′-yl)carbamate US10351563, Example 220 US10723734, Example 220 US9902722, Example 220
TypeSmall organic molecule
Emp. Form.C20H25F3N4O3
Mol. Mass.426.4327
SMILESCOC(=O)Nc1cc(ccn1)-c1cnc(OC[C@@](C)(N)CC(C)C)c(c1)C(F)(F)F